summary description
type: DatatypeProperty
comment: brought back from BSP (UNVTD grounding gap)
domain includes: Consignment
range includes: string
definition: A textual summary description of this supply chain consignment.
term status: proposed