tariff currency code
type: ObjectProperty
comment: added from BSP (per-class property assessment)
domain includes: ServiceCharge
range includes: currency-code-list
definition: A code specifying a tariff currency for this logistics service charge.
term status: proposed