tariff deduction quantity
type: ObjectProperty
comment: added from BSP (per-class property assessment)
definition: A quantity to be deducted from the tariff quantity for the calculation of this trade related tax, duty or levy.
domain includes: TradeTax
range includes: Measure
term status: proposed