trade payment terms direct debit mandate id
type: ObjectProperty
comment: added from BSP (per-class property assessment)
definition: An identifier of a direct debit mandate in these trade payment terms.
domain includes: PaymentTerms
range includes: Identifier
term status: proposed