trade settlement payment means id
type: ObjectProperty
comment: added from BSP (per-class property assessment)
domain includes: PaymentMeans
range includes: PaymentMeans
definition: An identifier for this trade settlement payment means.
term status: proposed