trade terms conditions code
type: ObjectProperty
provenance: Proposed Vocab addition — not from BSP/UNTP; pending governance approval.
domain includes: TradeAgreement
range includes: any-code
definition: A code specifying the terms and conditions applying to the trade agreement.
term status: proposed