transit direction code
type: ObjectProperty
comment: code → transport-means-direction scheme (re-added from BSP).
domain includes: TransportMovement
range includes: transport-means-direction-code-list
definition: The transit direction of this transport movement.
term status: proposed