transport stage
type: ObjectProperty
comment: code → transport-stage scheme.
domain includes: TransportLeg
range includes: transport-movement-stage-code-list
definition: The carriage stage of the leg (pre-carriage, main carriage, on-carriage).
term status: proposed