trustmark
type: ObjectProperty
domain includes: ConformityAttestation
domain includes: ConformityScheme
domain includes: Endorsement
range includes: Image
definition: A trustmark image associated with the attestation, scheme or endorsement.
term status: proposed