year
type: Concept
definition: Unit of time equal to 365,25 days. Synonym: Julian year
in scheme: unit-of-measure
notation: ANN
conversion multiplier: 31557600.0
dimension vector: T1
rec20 quantity: time
rec20 sector: Space and Time
ucum code: a
unit symbol: y