american wire gauge
type: Concept
definition: A unit of distance used for measuring the diameter of small tubes or wires such as the outer diameter od hypodermic or suture needles.
in scheme: unit-of-measure
notation: AWG
dimension vector: 1
rec20 quantity: length, breadth, height, thickness, radius, radius of curvature, cartesian coordinates, diameter, length of path, distance
rec20 sector: Space and Time
unit symbol: AWG