sone
type: Concept
definition: A unit of subjective sound loudness. One sone is the loudness of a pure tone of frequency one kilohertz and strength 40 decibels.
in scheme: unit-of-measure
notation: D15
conversion multiplier: 1.0
dimension vector: 1
rec20 quantity: loudness
rec20 sector: Acoustics