newton per square centimetre
type: Concept
definition: A measure of pressure expressed in newtons per square centimetre.
in scheme: unit-of-measure
notation: E01
conversion multiplier: 10000.0
dimension vector: L-1 M1 T-2
rec20 quantity: pressure, normal stress, shear stress, modulus of elasticity,shear modulus, modulus of rigidity, bulk modulus, modulus of compression
rec20 sector: Mechanics
ucum code: N.cm-2
unit symbol: N/cm²