slug
type: Concept
definition: A unit of mass. One slug is the mass accelerated at 1 foot per second per second by a force of 1 pound.
in scheme: unit-of-measure
notation: F13
conversion multiplier: 14.593903
dimension vector: M1
rec20 quantity: mass
rec20 sector: Mechanics
unit symbol: slug