rod [unit of distance]
type: Concept
definition: A unit of distance equal to 5.5 yards (16 feet 6 inches).
in scheme: unit-of-measure
notation: F49
conversion multiplier: 5.02921
dimension vector: L1
rec20 quantity: length, breadth, height, thickness, radius, radius of curvature, cartesian coordinates, diameter, length of path, distance
rec20 sector: Space and Time
ucum code: [rd_br]
unit symbol: rd (US)