degree Fahrenheit
type: Concept
definition: Refer ISO 80000-5 (Quantities and units — Part 5: Thermodynamics)
in scheme: unit-of-measure
notation: FAH
conversion multiplier: 0.5555555555555556
conversion offset: 459.67
dimension vector: Θ1
rec20 quantity: fahrenheit temperature
rec20 sector: Heat
ucum code: [degF]
unit symbol: °F