mil
type: Concept
definition: Unit to indicate an angle at military zone, equal to the 6400th part of the full circle of the 360° or 2·p·rad.
in scheme: unit-of-measure
notation: M43
rec20 quantity: angle (plane)
rec20 sector: Space and Time
unit symbol: mil