mile per minute
type: Concept
definition: Unit of velocity from the Imperial system of units.
in scheme: unit-of-measure
notation: M57
conversion multiplier: 26.8224
dimension vector: L1 T-1
rec20 quantity: velocity, phase velocity, group velocity
rec20 sector: Space and Time
ucum code: [mi_i].min-1
unit symbol: mi/min