mile per second
type: Concept
definition: Unit of the velocity from the Imperial system of units.
in scheme: unit-of-measure
notation: M58
conversion multiplier: 1609.344
dimension vector: L1 T-1
rec20 quantity: velocity, phase velocity, group velocity
rec20 sector: Space and Time
ucum code: [mi_i].sec-1
unit symbol: mi/s