metre per second pascal
type: Concept
definition: SI base unit meter divided by the product of SI base unit second and the derived SI unit pascal.
in scheme: unit-of-measure
notation: M59
conversion multiplier: 1.0
dimension vector: L2 M-1 T1
rec20 quantity: velocity, phase velocity, group velocity
rec20 sector: Space and Time
ucum code: m.s-1.Pa-1
unit symbol: (m/s)/Pa