metre per hour
type: Concept
definition: SI base unit metre divided by the unit hour.
in scheme: unit-of-measure
notation: M60
conversion multiplier: 0.000277777778
dimension vector: L1 T-1
rec20 quantity: velocity, phase velocity, group velocity
rec20 sector: Space and Time
ucum code: m.h-1
unit symbol: m/h