acre-foot (based on U.S. survey foot)
type: Concept
definition: Unit of the volume, which is used in the United States to measure/gauge the capacity of reservoirs.
in scheme: unit-of-measure
notation: M67
conversion multiplier: 1233.4842656613735
dimension vector: L3
rec20 quantity: volume
rec20 sector: Space and Time
ucum code: [acr_br].[ft_us]
unit symbol: acre-ft (US survey)