kilopound-force
type: Concept
definition: 1000-fold of the unit of the force pound-force (lbf) according to the Anglo-American system of units with the relationship.
in scheme: unit-of-measure
notation: M75
conversion multiplier: 4448.222
dimension vector: L1 M1 T-2
rec20 quantity: force, weight
rec20 sector: Mechanics
ucum code: k[lbf_av]
unit symbol: kip