pound-force foot
type: Concept
definition: Product of the unit pound-force according to the Anglo-American system of units and the unit foot according to the Anglo-American and the Imperial system of units.
in scheme: unit-of-measure
notation: M92
conversion multiplier: 1.35581807
dimension vector: L2 M1 T-2
rec20 quantity: moment of force, moment of a couple, torque
rec20 sector: Mechanics
ucum code: [lbf_av].[ft_i]
unit symbol: lbf·ft