kilogram centimetre per second
type: Concept
definition: Product of the SI base unit kilogram and the 0,01-fold of the SI base unit metre divided by the SI base unit second.
in scheme: unit-of-measure
notation: M98
conversion multiplier: 0.01
dimension vector: L1 M1 T-1
rec20 quantity: momentum
rec20 sector: Mechanics
ucum code: kg.cm.s-1
unit symbol: kg·(cm/s)