pound foot per second
type: Concept
definition: Product of the avoirdupois pound according to the avoirdupois unit system and the unit foot according to the Anglo-American and Imperial system of units divided by the SI base unit second.
in scheme: unit-of-measure
notation: N10
conversion multiplier: 0.138254954376
dimension vector: L1 M1 T-1
rec20 quantity: momentum
rec20 sector: Mechanics
ucum code: [lb_av].[ft_i].s-1
unit symbol: lb·(ft/s)