kilonewton per metre
type: Concept
definition: 1000-fold of the derived SI unit newton divided by the SI base unit metre.
in scheme: unit-of-measure
notation: N31
conversion multiplier: 1000.0
dimension vector: M1 T-2
rec20 quantity: surface tension
rec20 sector: Mechanics
ucum code: kN.m-1
unit symbol: kN/m