newton second per square metre
type: Concept
definition: Unit of the dynamic viscosity as a product of unit of the pressure (newton by square metre) multiplied with the SI base unit second.
in scheme: unit-of-measure
notation: N36
conversion multiplier: 1.0
dimension vector: L-1 M1 T-1
rec20 quantity: viscosity (dynamic viscosity)
rec20 sector: Mechanics
ucum code: N.s.m-2
unit symbol: (N/m²)·s