kilogram per metre minute
type: Concept
definition: Unit of the dynamic viscosity as a quotient SI base unit kilogram divided by the SI base unit metre and by the unit minute.
in scheme: unit-of-measure
notation: N38
conversion multiplier: 0.016666666666666666
dimension vector: L-1 M1 T-1
rec20 quantity: viscosity (dynamic viscosity)
rec20 sector: Mechanics
ucum code: kg.m-1.min-1
unit symbol: kg/(m·min)