inch poundal
type: Concept
definition: Unit of work (force multiplied by path) according to the Imperial system of units as a product unit inch multiplied by poundal.
in scheme: unit-of-measure
notation: N47
conversion multiplier: 0.0035116758411504
dimension vector: L2 M1 T-2
rec20 quantity: work, energy, potential energy, kinetic energy
rec20 sector: Mechanics
ucum code: [in_i].[lb_av].[ft_i].s-2
unit symbol: in·pdl