British thermal unit (international table) per square inch second
type: Concept
definition: Unit of the surface heat flux according to the Imperial system of units.
in scheme: unit-of-measure
notation: N55
conversion multiplier: 1635339.8422406844
dimension vector: M1 T-3
rec20 quantity: density of heat flow rate
rec20 sector: Heat
ucum code: [Btu_IT].[in_i]-2.s-1
unit symbol: BtuIT/(in²·s)