British thermal unit (thermochemical) per cubic foot
type: Concept
definition: Unit of the energy density according to the Imperial system of units.
in scheme: unit-of-measure
notation: N59
conversion multiplier: 37234.03
dimension vector: L-1 M1 T-2
rec20 quantity: energy density
rec20 sector: Heat
ucum code: [Btu_th].[ft_i]-3
unit symbol: Btuth/ft³