British thermal unit (international table) per degree Fahrenheit
type: Concept
definition: Unit of the heat capacity according to the Imperial system of units.
in scheme: unit-of-measure
notation: N60
conversion multiplier: 1899.100535
dimension vector: L2 M1 Θ-1 T-2
rec20 quantity: heat capacity, entropy
rec20 sector: Heat
ucum code: [Btu_IT].[degF]-1
unit symbol: BtuIT/ºF