quad (1015 BtuIT)
type: Concept
definition: Unit of heat energy according to the imperial system of units.
in scheme: unit-of-measure
notation: N70
conversion multiplier: 1.055e+18
dimension vector: L2 M1 T-2
rec20 quantity: heat, quantity of heat, energy, thermodynamic energy, enthalpy, Helmholtz function, Helmholtz free energy
rec20 sector: Heat
unit symbol: quad