therm (EC)
type: Concept
definition: Unit of heat energy in commercial use, within the EU defined: 1 thm (EC) = 100 000 BtuIT.
in scheme: unit-of-measure
notation: N71
dimension vector: L2 M1 T-2
rec20 quantity: heat, quantity of heat, energy, thermodynamic energy, enthalpy, Helmholtz function, Helmholtz free energy
rec20 sector: Heat
unit symbol: thm (EC)