British thermal unit (thermochemical) per pound
type: Concept
definition: Unit of the heat energy according to the Imperial system of units divided the unit avoirdupois pound according to the avoirdupois system of units.
in scheme: unit-of-measure
notation: N73
conversion multiplier: 2324.443861
dimension vector: L2 T-2
rec20 quantity: massic Helmholtz free energy,
rec20 sector: Heat
ucum code: [Btu_th].[lb_av]-1
unit symbol: Btuth/lb