watt per metre degree Celsius
type: Concept
definition: Derived SI unit watt divided by the product of the SI base unit metre and the unit for temperature degree Celsius.
in scheme: unit-of-measure
notation: N80
conversion multiplier: 1.0
dimension vector: L1 M1 Θ-1 T-3
rec20 quantity: thermal conductivity
rec20 sector: Heat
ucum code: W.m-1.Cel-1
unit symbol: W/(m·°C)