degree Fahrenheit second per British thermal unit (international table)
type: Concept
definition: Non SI-conforming unit of the thermal resistance according to the Imperial system of units.
in scheme: unit-of-measure
notation: N86
conversion multiplier: 0.0005265650668407318
dimension vector: L-2 M-1 Θ1 T3
rec20 quantity: thermal resistance
rec20 sector: Heat
ucum code: [degF].s.[Btu_IT]-1
unit symbol: ºF/(BtuIT/s)