picosiemens
type: Concept
definition: 0,000 000 000 001-fold of the derived SI unit siemens.
in scheme: unit-of-measure
notation: N92
conversion multiplier: 1e-12
dimension vector: I2 L-2 M-1 T3
rec20 quantity: conductance (for direct current), admittance, (complex admittance), modulus of admittance,(admittance), conductance (for alternating current)
rec20 sector: Electricity and Magnetism
unit symbol: pS