franklin
type: Concept
definition: CGS (Centimetre-Gram-Second system) unit of the electrical charge, where the charge amounts to exactly 1 Fr where the force of 1 dyn on an equal load is performed at a distance of 1 cm.
in scheme: unit-of-measure
notation: N94
conversion multiplier: 3.335641e-10
dimension vector: I1 T1
rec20 quantity: electric charge, quantity of electricity, electric flux (flux of displacement)
rec20 sector: Electricity and Magnetism
unit symbol: Fr