gilbert
type: Concept
definition: CGS (Centimetre-Gram-Second system) unit of the magnetomotive force, which is defined by the work to increase the magnetic potential of a positive common pol with 1 erg.
in scheme: unit-of-measure
notation: N97
conversion multiplier: 0.795774715
dimension vector: I1
rec20 quantity: electric current, magnetic potential difference, magnetomotive force,current linkage
rec20 sector: Electricity and Magnetism
ucum code: Gb
unit symbol: Gi