joule per minute
type: Concept
definition: Quotient from the derived SI unit joule divided by the unit minute.
in scheme: unit-of-measure
notation: P15
conversion multiplier: 0.016666666666666666
dimension vector: L2 M1 T-3
rec20 quantity: power (for direct current), active power
rec20 sector: Electricity and Magnetism
ucum code: J.min-1
unit symbol: J/min