kilojoule per day
type: Concept
definition: Quotient from the 1000-fold of the derived SI unit joule divided by the unit day.
in scheme: unit-of-measure
notation: P21
conversion multiplier: 0.011574074074074073
dimension vector: L2 M1 T-3
rec20 quantity: power (for direct current), active power
rec20 sector: Electricity and Magnetism
ucum code: kJ.d-1
unit symbol: kJ/d