newton square metre per ampere
type: Concept
definition: Product of the derived SI unit newton and the power of SI base unit metre with exponent 2 divided by the SI base unit ampere.
in scheme: unit-of-measure
notation: P49
conversion multiplier: 1.0
dimension vector: I-1 L3 M1 T-2
rec20 quantity: magnetic dipole moment
rec20 sector: Physical Chemistry and Molecular Physics
ucum code: N.m2.A-1
unit symbol: N·m²/A