mol per kilogram pascal
type: Concept
definition: SI base unit mol divided by the product of the SI base unit kilogram and the derived SI unit pascal.
in scheme: unit-of-measure
notation: P51
conversion multiplier: 1.0
dimension vector: N1 L1 M-2 T2
rec20 quantity: volumic mass, mass density, density, mass concentration of B, amount of substance, concentration of B
rec20 sector: Physical Chemistry and Molecular Physics
ucum code: mol.kg-1.Pa-1
unit symbol: (mol/kg)/Pa