kilopascal per metre
type: Concept
definition: 1000-fold of the derived SI unit pascal divided by the SI base unit metre.
in scheme: unit-of-measure
notation: P81
conversion multiplier: 1000.0
dimension vector: L-2 M1 T-2
rec20 quantity: hardness index
rec20 sector: Miscellaneous
ucum code: kPa.m-1
unit symbol: kPa/m