megawatts per minute
type: Concept
definition: A unit of power defining the total amount of bulk energy transferred or consumer per minute
in scheme: unit-of-measure
notation: Q35
rec20 quantity: Power flow rate
rec20 sector: Mechanics
unit symbol: MW/min