Standard cubic metre
type: Concept
definition: Standard cubic metre (temperature 15°C and pressure 101325 millibars )
in scheme: unit-of-measure
notation: SM3
rec20 quantity: volume
rec20 sector: Space and Time