use code
type: ObjectProperty
comment: added from BSP (per-class property assessment)
domain includes: ContactPoint
range includes: any-code
definition: The code specifying the use of this universal communication such as for business purposes or private.
term status: proposed