transport equipment fullness used capacity code
type: ObjectProperty
comment: added from BSP (default-keep re-triage)
definition: The code specifying the used capacity of this piece of logistics transport equipment, such as full or empty.
domain includes: TransportEquipment
range includes: transport-equipment-fullness-code-list
term status: proposed